Reaction Details
TargetDipeptidyl peptidase 9
LigandBDBM50050525
Substrate/Competitorn/a
Meas. Tech.ChEMBL_832307 (CHEMBL2066845)
IC50 2.8±n/a nM
Citation Wu, WLiu, YMilo, LJShu, YZhao, PLi, YWoznica, IYu, GSanford, DGZhou, YPoplawski, SEConnolly, BASudmeier, JLBachovchin, WWLai, JH 4-Substituted boro-proline dipeptides: synthesis, characterization, and dipeptidyl peptidase IV, 8, and 9 activities. Bioorg Med Chem Lett22:5536-40 (2012) 
 
Dipeptidyl peptidase 9
Name:Dipeptidyl peptidase 9
Type:Enzyme
Mol. Mass.:98260.70
Organism:Homo sapiens (Human)
Description:Q86TI2
Residue:863
BDBM50050525
NameBDBM50050525
Synonyms:(R)-1-((S)-2-aminopropanoyl)pyrrolidin-2-ylboronic acid CHEMBL63860 US11559537, Compound 1129 US8933056, Asp-boroPro
TypeSmall organic molecule
Emp. Form.C7H15BN2O3
Mol. Mass.186.017
SMILESC[C@H](N)C(=O)N1CCC[C@H]1B(O)O