Reaction Details
TargetCannabinoid receptor 1
LigandBDBM50389927
Substrate/Competitorn/a
Meas. Tech.ChEMBL_834869 (CHEMBL2073229)
EC50 960±n/a nM
Citation Piscitelli, FLigresti, ALa Regina, GColuccia, AMorera, LAllarà, MNovellino, EDi Marzo, VSilvestri, R Indole-2-carboxamides as allosteric modulators of the cannabinoid CB1 receptor. J Med Chem55:5627-31 (2012) 
 
Cannabinoid receptor 1
Name:Cannabinoid receptor 1
Type:G Protein-Coupled Receptor (GPCR)
Mol. Mass.:52868.96
Organism:Homo sapiens (Human)
Description:P21554
Residue:472
BDBM50389927
NameBDBM50389927
Synonyms:CHEMBL2071062
TypeSmall organic molecule
Emp. Form.C20H22ClN3O
Mol. Mass.355.861
SMILESCCc1c([nH]c2ccc(Cl)cc12)C(=O)NCCc1ccc(NC)cc1