Reaction Details
TargetCannabinoid receptor 1
LigandBDBM50389943
Substrate/Competitorn/a
Meas. Tech.ChEMBL_834870 (CHEMBL2073230)
IC50>10000±n/a nM
Citation Piscitelli, FLigresti, ALa Regina, GColuccia, AMorera, LAllarà, MNovellino, EDi Marzo, VSilvestri, R Indole-2-carboxamides as allosteric modulators of the cannabinoid CB1 receptor. J Med Chem55:5627-31 (2012) 
 
Cannabinoid receptor 1
Name:Cannabinoid receptor 1
Type:G Protein-Coupled Receptor (GPCR)
Mol. Mass.:52868.96
Organism:Homo sapiens (Human)
Description:P21554
Residue:472
BDBM50389943
NameBDBM50389943
Synonyms:CHEMBL2071067
TypeSmall organic molecule
Emp. Form.C24H26ClN3O2
Mol. Mass.423.935
SMILESCC(=O)c1c([nH]c2ccc(Cl)cc12)C(=O)NCCc1ccc(cc1)N1CCCCC1