Reaction Details
TargetCannabinoid receptor 1
LigandBDBM50389944
Substrate/Competitorn/a
Meas. Tech.ChEMBL_834870 (CHEMBL2073230)
IC50>10000±n/a nM
Citation Piscitelli, FLigresti, ALa Regina, GColuccia, AMorera, LAllarà, MNovellino, EDi Marzo, VSilvestri, R Indole-2-carboxamides as allosteric modulators of the cannabinoid CB1 receptor. J Med Chem55:5627-31 (2012) 
 
Cannabinoid receptor 1
Name:Cannabinoid receptor 1
Type:G Protein-Coupled Receptor (GPCR)
Mol. Mass.:52868.96
Organism:Homo sapiens (Human)
Description:P21554
Residue:472
BDBM50389944
NameBDBM50389944
Synonyms:CHEMBL2071073
TypeSmall organic molecule
Emp. Form.C17H16ClN3O
Mol. Mass.313.781
SMILESNc1ccc(CCNC(=O)c2cc3cc(Cl)ccc3[nH]2)cc1