Reaction Details
TargetCannabinoid receptor 2
LigandBDBM50389929
Substrate/Competitorn/a
Meas. Tech.ChEMBL_834876 (CHEMBL2073236)
IC50>10000±n/a nM
Citation Piscitelli, FLigresti, ALa Regina, GColuccia, AMorera, LAllarà, MNovellino, EDi Marzo, VSilvestri, R Indole-2-carboxamides as allosteric modulators of the cannabinoid CB1 receptor. J Med Chem55:5627-31 (2012) 
 
Cannabinoid receptor 2
Name:Cannabinoid receptor 2
Type:G Protein-Coupled Receptor (GPCR)
Mol. Mass.:39690.94
Organism:Homo sapiens (Human)
Description:P34972
Residue:360
BDBM50389929
NameBDBM50389929
Synonyms:CHEMBL2071064
TypeSmall organic molecule
Emp. Form.C20H21ClN2O
Mol. Mass.340.847
SMILESCCc1c([nH]c2ccc(Cl)cc12)C(=O)NCCc1ccc(C)cc1