Reaction Details
TargetGlycogen synthase kinase-3 beta
LigandBDBM50390498
Substrate/Competitorn/a
Meas. Tech.ChEMBL_835303 (CHEMBL2072009)
IC50 44500±n/a nM
Citation Hua, ZHuang, XBregman, HChakka, NDiMauro, EFDoherty, EMGoldstein, JGunaydin, HHuang, HMercede, SNewcomb, JPatel, VFTurci, SMYan, JWilson, CMartin, MW 2-Phenylamino-6-cyano-1H-benzimidazole-based isoform selective casein kinase 1 gamma (CK1¿) inhibitors. Bioorg Med Chem Lett22:5392-5 (2012) 
 
Glycogen synthase kinase-3 beta
Name:Glycogen synthase kinase-3 beta
Type:Enzyme
Mol. Mass.:46756.38
Organism:Homo sapiens (Human)
Description:P49841
Residue:420
BDBM50390498
NameBDBM50390498
Synonyms:CHEMBL2071612
TypeSmall organic molecule
Emp. Form.C18H18N4
Mol. Mass.290.3623
SMILESCC(C)(C)c1ccc(Nc2nc3ccc(cc3[nH]2)C#N)cc1