Reaction Details
TargetCasein kinase I isoform gamma-2
LigandBDBM50390495
Substrate/Competitorn/a
Meas. Tech.ChEMBL_835304 (CHEMBL2072010)
IC50 4890±n/a nM
Citation Hua, ZHuang, XBregman, HChakka, NDiMauro, EFDoherty, EMGoldstein, JGunaydin, HHuang, HMercede, SNewcomb, JPatel, VFTurci, SMYan, JWilson, CMartin, MW 2-Phenylamino-6-cyano-1H-benzimidazole-based isoform selective casein kinase 1 gamma (CK1¿) inhibitors. Bioorg Med Chem Lett22:5392-5 (2012) 
 
Casein kinase I isoform gamma-2
Name:Casein kinase I isoform gamma-2
Type:PROTEIN
Mol. Mass.:47475.36
Organism:Homo sapiens (Human)
Description:ChEMBL_774313
Residue:415
BDBM50390495
NameBDBM50390495
Synonyms:CHEMBL2071609
TypeSmall organic molecule
Emp. Form.C20H14N4
Mol. Mass.310.352
SMILESN#Cc1ccc2nc(Nc3ccc(cc3)-c3ccccc3)[nH]c2c1