Reaction Details
TargetCasein kinase I isoform gamma-2
LigandBDBM50390504
Substrate/Competitorn/a
Meas. Tech.ChEMBL_835304 (CHEMBL2072010)
IC50 13000±n/a nM
Citation Hua, ZHuang, XBregman, HChakka, NDiMauro, EFDoherty, EMGoldstein, JGunaydin, HHuang, HMercede, SNewcomb, JPatel, VFTurci, SMYan, JWilson, CMartin, MW 2-Phenylamino-6-cyano-1H-benzimidazole-based isoform selective casein kinase 1 gamma (CK1¿) inhibitors. Bioorg Med Chem Lett22:5392-5 (2012) 
 
Casein kinase I isoform gamma-2
Name:Casein kinase I isoform gamma-2
Type:PROTEIN
Mol. Mass.:47475.36
Organism:Homo sapiens (Human)
Description:ChEMBL_774313
Residue:415
BDBM50390504
NameBDBM50390504
Synonyms:CHEMBL2071622
TypeSmall organic molecule
Emp. Form.C19H20N4
Mol. Mass.304.3889
SMILESCc1cc2nc(Nc3ccc(cc3)C(C)(C)C)[nH]c2cc1C#N