Reaction Details
TargetDeoxyuridine 5'-triphosphate nucleotidohydrolase, mitochondrial
LigandBDBM50391348
Substrate/Competitorn/a
Meas. Tech.ChEMBL_847915 (CHEMBL2150114)
IC50 73±n/a nM
Citation Miyahara, SMiyakoshi, HYokogawa, TChong, KTTaguchi, JMuto, TEndoh, KYano, WWakasa, TUeno, HTakao, YFujioka, AHashimoto, AItou, KYamamura, KNomura, MNagasawa, HShuto, SFukuoka, M Discovery of highly potent human deoxyuridine triphosphatase inhibitors based on the conformation restriction strategy. J Med Chem55:5483-96 (2012) 
 
Deoxyuridine 5'-triphosphate nucleotidohydrolase, mitochondrial
Name:Deoxyuridine 5'-triphosphate nucleotidohydrolase, mitochondrial
Type:Enzyme
Mol. Mass.:26574.03
Organism:Homo sapiens (Human)
Description:P33316
Residue:252
BDBM50391348
NameBDBM50391348
Synonyms:CHEMBL2147977
TypeSmall organic molecule
Emp. Form.C22H23F2N3O5S
Mol. Mass.479.497
SMILESCC(C)(NS(=O)(=O)c1cccc(OCC(F)F)c1)c1ccc(Cn2ccc(=O)[nH]c2=O)cc1