Reaction Details
TargetHydroxycarboxylic acid receptor 2
LigandBDBM50336491
Substrate/Competitorn/a
Meas. Tech.ChEMBL_850284 (CHEMBL2150704)
EC50 215000±n/a nM
Citation Dvorak, CALiu, CShelton, JKuei, CSutton, SWLovenberg, TWCarruthers, NI Identification of Hydroxybenzoic Acids as Selective Lactate Receptor (GPR81) Agonists with Antilipolytic Effects. ACS Med Chem Lett3:637-639 (2012) 
 
Hydroxycarboxylic acid receptor 2
Name:Hydroxycarboxylic acid receptor 2
Type:G Protein-Coupled Receptor (GPCR)
Mol. Mass.:41868.22
Organism:Homo sapiens (Human)
Description:Membranes from CHO cells expressing the recombinant human GPR109A were used in competition binding assay.
Residue:363
BDBM50336491
NameBDBM50336491
Synonyms:3-Hydroxy-benzoic acid 3-Hydroxybenzoate, II CHEMBL65369
TypeSmall organic molecule
Emp. Form.C7H6O3
Mol. Mass.138.1207
SMILESOC(=O)c1cccc(O)c1