Reaction Details
TargetHydroxycarboxylic acid receptor 1
LigandBDBM50391822
Substrate/Competitorn/a
Meas. Tech.ChEMBL_850283 (CHEMBL2150703)
EC50 38000±n/a nM
Citation Dvorak, CALiu, CShelton, JKuei, CSutton, SWLovenberg, TWCarruthers, NI Identification of Hydroxybenzoic Acids as Selective Lactate Receptor (GPR81) Agonists with Antilipolytic Effects. ACS Med Chem Lett3:637-639 (2012) 
 
Hydroxycarboxylic acid receptor 1
Name:Hydroxycarboxylic acid receptor 1
Type:PROTEIN
Mol. Mass.:39313.04
Organism:Homo sapiens (Human)
Description:ChEMBL_850283
Residue:346
BDBM50391822
NameBDBM50391822
Synonyms:CHEMBL2146989
TypeSmall organic molecule
Emp. Form.C7H5FO3
Mol. Mass.156.1112
SMILESOC(=O)c1cc(O)cc(F)c1