Reaction Details
TargetPhosphatidylinositol 4,5-bisphosphate 3-kinase catalytic subunit delta isoform
LigandBDBM50392144
Substrate/Competitorn/a
Meas. Tech.ChEMBL_851649 (CHEMBL2157248)
IC50 0.6±n/a nM
Citation Sutherlin, DPBaker, SBisconte, ABlaney, PMBrown, AChan, BKChantry, DCastanedo, GDePledge, PGoldsmith, PGoldstein, DMHancox, TKaur, JKnowles, DKondru, RLesnick, JLucas, MCLewis, CMurray, JNadin, AJNonomiya, JPang, JPegg, NPrice, SReif, KSafina, BSSalphati, LStaben, SSeward, EMShuttleworth, SSohal, SSweeney, ZKUltsch, MWaszkowycz, BWei, B Potent and selective inhibitors of PI3Kd: obtaining isoform selectivity from the affinity pocket and tryptophan shelf. Bioorg Med Chem Lett22:4296-302 (2012) 
 
Phosphatidylinositol 4,5-bisphosphate 3-kinase catalytic subunit delta isoform
Name:Phosphatidylinositol 4,5-bisphosphate 3-kinase catalytic subunit delta isoform
Type:Enzyme Subunit
Mol. Mass.:119489.41
Organism:Homo sapiens (Human)
Description:O00329
Residue:1044
BDBM50392144
NameBDBM50392144
Synonyms:CHEMBL2152774
TypeSmall organic molecule
Emp. Form.C26H31FN6O2S
Mol. Mass.510.627
SMILESCC(C)(O)C1CCN(Cc2nc3c(nc(nc3s2)-c2c(F)ccc3[nH]ccc23)N2CCOCC2)CC1