Reaction Details
TargetTyrosine-protein phosphatase non-receptor type 22
LigandBDBM50393463
Substrate/Competitorn/a
Meas. Tech.ChEMBL_855963 (CHEMBL2161837)
IC50 9190±n/a nM
Citation Stanford, SMKrishnamurthy, DFalk, MDMessina, RDebnath, BLi, SLiu, TKazemi, RDahl, RHe, YYu, XChan, ACZhang, ZYBarrios, AMWoods, VLNeamati, NBottini, N Discovery of a novel series of inhibitors of lymphoid tyrosine phosphatase with activity in human T cells. J Med Chem54:1640-54 (2011) 
 
Tyrosine-protein phosphatase non-receptor type 22
Name:Tyrosine-protein phosphatase non-receptor type 22
Type:n/a
Mol. Mass.:91712.31
Organism:Homo sapiens (Human)
Description:Q9Y2R2
Residue:807
BDBM50393463
NameBDBM50393463
Synonyms:CHEMBL2159940
TypeSmall organic molecule
Emp. Form.C31H31ClN6O
Mol. Mass.539.07
SMILESCc1ccc2[nH]c(=O)c(cc2c1)C(N(Cc1ccccc1)Cc1ccc(Cl)cc1)c1nnnn1C1CCCC1