Reaction Details
TargetTyrosine-protein phosphatase non-receptor type 22
LigandBDBM50393488
Substrate/Competitorn/a
Meas. Tech.ChEMBL_855963 (CHEMBL2161837)
IC50 9130±n/a nM
Citation Stanford, SMKrishnamurthy, DFalk, MDMessina, RDebnath, BLi, SLiu, TKazemi, RDahl, RHe, YYu, XChan, ACZhang, ZYBarrios, AMWoods, VLNeamati, NBottini, N Discovery of a novel series of inhibitors of lymphoid tyrosine phosphatase with activity in human T cells. J Med Chem54:1640-54 (2011) 
 
Tyrosine-protein phosphatase non-receptor type 22
Name:Tyrosine-protein phosphatase non-receptor type 22
Type:n/a
Mol. Mass.:91712.31
Organism:Homo sapiens (Human)
Description:Q9Y2R2
Residue:807
BDBM50393488
NameBDBM50393488
Synonyms:CHEMBL2159962
TypeSmall organic molecule
Emp. Form.C35H39N7O
Mol. Mass.573.7305
SMILESCc1ccc2cc(C(N3CCN(CC3)C(c3ccccc3)c3ccccc3)c3nnnn3C3CCCC3)c(=O)[nH]c2c1C