Reaction Details
TargetLow molecular weight phosphotyrosine protein phosphatase
LigandBDBM50393492
Substrate/Competitorn/a
Meas. Tech.ChEMBL_855961 (CHEMBL2161835)
IC50>90000±n/a nM
Citation Stanford, SMKrishnamurthy, DFalk, MDMessina, RDebnath, BLi, SLiu, TKazemi, RDahl, RHe, YYu, XChan, ACZhang, ZYBarrios, AMWoods, VLNeamati, NBottini, N Discovery of a novel series of inhibitors of lymphoid tyrosine phosphatase with activity in human T cells. J Med Chem54:1640-54 (2011) 
 
Low molecular weight phosphotyrosine protein phosphatase
Name:Low molecular weight phosphotyrosine protein phosphatase
Type:n/a
Mol. Mass.:18042.81
Organism:Homo sapiens (Human)
Description:P24666
Residue:158
BDBM50393492
NameBDBM50393492
Synonyms:CHEMBL2159933
TypeSmall organic molecule
Emp. Form.C17H11ClN2OS2
Mol. Mass.358.865
SMILESCc1ccc2sc(NC(=O)c3sc4ccccc4c3Cl)nc2c1