Reaction Details
TargetTyrosine-protein phosphatase non-receptor type 22
LigandBDBM46264
Substrate/Competitorn/a
Meas. Tech.ChEMBL_855966 (CHEMBL2161840)
Ki 38060±n/a nM
Citation Stanford, SMKrishnamurthy, DFalk, MDMessina, RDebnath, BLi, SLiu, TKazemi, RDahl, RHe, YYu, XChan, ACZhang, ZYBarrios, AMWoods, VLNeamati, NBottini, N Discovery of a novel series of inhibitors of lymphoid tyrosine phosphatase with activity in human T cells. J Med Chem54:1640-54 (2011) 
 
Tyrosine-protein phosphatase non-receptor type 22
Name:Tyrosine-protein phosphatase non-receptor type 22
Type:n/a
Mol. Mass.:91712.31
Organism:Homo sapiens (Human)
Description:Q9Y2R2
Residue:807
BDBM46264
NameBDBM46264
Synonyms:3-[2-azaspiro[5.5]undecan-2-yl-(1-cyclopentyl-1,2,3,4-tetrazol-5-yl)methyl]-6-methyl-1H-quinolin-2-one 3-[2-azaspiro[5.5]undecan-2-yl-(1-cyclopentyltetrazol-5-yl)methyl]-6-methyl-1H-quinolin-2-one MLS-0412204.0001 | cid_3182456
TypeSmall organic molecule
Emp. Form.C27H36N6O
Mol. Mass.460.6143
SMILESCc1ccc2[nH]c(=O)c(cc2c1)C(N1CCCC2(CCCCC2)C1)c1nnnn1C1CCCC1