Reaction Details
TargetTyrosine-protein phosphatase non-receptor type 7
LigandBDBM50393502
Substrate/Competitorn/a
Meas. Tech.ChEMBL_855971 (CHEMBL2161972)
IC50 12000±n/a nM
Citation Stanford, SMKrishnamurthy, DFalk, MDMessina, RDebnath, BLi, SLiu, TKazemi, RDahl, RHe, YYu, XChan, ACZhang, ZYBarrios, AMWoods, VLNeamati, NBottini, N Discovery of a novel series of inhibitors of lymphoid tyrosine phosphatase with activity in human T cells. J Med Chem54:1640-54 (2011) 
 
Tyrosine-protein phosphatase non-receptor type 7
Name:Tyrosine-protein phosphatase non-receptor type 7
Type:Protein
Mol. Mass.:40530.79
Organism:Homo sapiens (Human)
Description:P35236
Residue:360
BDBM50393502
NameBDBM50393502
Synonyms:CHEMBL2159929
TypeSmall organic molecule
Emp. Form.C20H15N3O3S
Mol. Mass.377.416
SMILESCc1ccc2cc(C#N)c(SCC(=O)Nc3ccc4OCOc4c3)nc2c1