Reaction Details
TargetTyrosine-protein phosphatase non-receptor type 7
LigandBDBM50393491
Substrate/Competitorn/a
Meas. Tech.ChEMBL_855971 (CHEMBL2161972)
IC50 16000±n/a nM
Citation Stanford, SMKrishnamurthy, DFalk, MDMessina, RDebnath, BLi, SLiu, TKazemi, RDahl, RHe, YYu, XChan, ACZhang, ZYBarrios, AMWoods, VLNeamati, NBottini, N Discovery of a novel series of inhibitors of lymphoid tyrosine phosphatase with activity in human T cells. J Med Chem54:1640-54 (2011) 
 
Tyrosine-protein phosphatase non-receptor type 7
Name:Tyrosine-protein phosphatase non-receptor type 7
Type:Protein
Mol. Mass.:40530.79
Organism:Homo sapiens (Human)
Description:P35236
Residue:360
BDBM50393491
NameBDBM50393491
Synonyms:CHEMBL2159932
TypeSmall organic molecule
Emp. Form.C22H21N3O2S
Mol. Mass.391.486
SMILESCCOc1ccc(NC(=O)CSc2nc3c(C)cc(C)cc3cc2C#N)cc1