Reaction Details
TargetTyrosine-protein phosphatase non-receptor type 7
LigandBDBM50393492
Substrate/Competitorn/a
Meas. Tech.ChEMBL_855971 (CHEMBL2161972)
IC50 8000±n/a nM
Citation Stanford, SMKrishnamurthy, DFalk, MDMessina, RDebnath, BLi, SLiu, TKazemi, RDahl, RHe, YYu, XChan, ACZhang, ZYBarrios, AMWoods, VLNeamati, NBottini, N Discovery of a novel series of inhibitors of lymphoid tyrosine phosphatase with activity in human T cells. J Med Chem54:1640-54 (2011) 
 
Tyrosine-protein phosphatase non-receptor type 7
Name:Tyrosine-protein phosphatase non-receptor type 7
Type:Protein
Mol. Mass.:40530.79
Organism:Homo sapiens (Human)
Description:P35236
Residue:360
BDBM50393492
NameBDBM50393492
Synonyms:CHEMBL2159933
TypeSmall organic molecule
Emp. Form.C17H11ClN2OS2
Mol. Mass.358.865
SMILESCc1ccc2sc(NC(=O)c3sc4ccccc4c3Cl)nc2c1