Reaction Details
TargetTyrosine-protein phosphatase non-receptor type 22
LigandBDBM50393498
Substrate/Competitorn/a
Meas. Tech.ChEMBL_855963 (CHEMBL2161837)
IC50 26600±n/a nM
Citation Stanford, SMKrishnamurthy, DFalk, MDMessina, RDebnath, BLi, SLiu, TKazemi, RDahl, RHe, YYu, XChan, ACZhang, ZYBarrios, AMWoods, VLNeamati, NBottini, N Discovery of a novel series of inhibitors of lymphoid tyrosine phosphatase with activity in human T cells. J Med Chem54:1640-54 (2011) 
 
Tyrosine-protein phosphatase non-receptor type 22
Name:Tyrosine-protein phosphatase non-receptor type 22
Type:n/a
Mol. Mass.:91712.31
Organism:Homo sapiens (Human)
Description:Q9Y2R2
Residue:807
BDBM50393498
NameBDBM50393498
Synonyms:CHEMBL2159930
TypeSmall organic molecule
Emp. Form.C22H21N3OS
Mol. Mass.375.487
SMILESCc1ccc(NC(=O)CSc2nc3c(C)c(C)ccc3cc2C#N)cc1C