Reaction Details
TargetGlucagon receptor
LigandBDBM50393785
Substrate/Competitorn/a
Meas. Tech.ChEMBL_857260 (CHEMBL2160605)
IC50 4.6±n/a nM
Citation Xiong, YGuo, JCandelore, MRLiang, RMiller, CDallas-Yang, QJiang, GMcCann, PEQureshi, SATong, XXu, SSShang, JVincent, SHTota, LMWright, MJYang, XZhang, BBTata, JRParmee, ER Discovery of a novel glucagon receptor antagonist N-[(4-{(1S)-1-[3-(3, 5-dichlorophenyl)-5-(6-methoxynaphthalen-2-yl)-1H-pyrazol-1-yl]ethyl}phenyl)carbonyl]-ß-alanine (MK-0893) for the treatment of type II diabetes. J Med Chem55:6137-48 (2012) 
 
Glucagon receptor
Name:Glucagon receptor
Type:Enzyme
Mol. Mass.:54026.92
Organism:Homo sapiens (Human)
Description:P47871
Residue:477
BDBM50393785
NameBDBM50393785
Synonyms:CHEMBL2159341
TypeSmall organic molecule
Emp. Form.C32H27Cl2N3O3
Mol. Mass.572.481
SMILESC[C@@H](c1ccc(cc1)C(=O)NCCC(O)=O)n1nc(cc1-c1ccc2cc(C)ccc2c1)-c1cc(Cl)cc(Cl)c1