Reaction Details
TargetGastric inhibitory polypeptide receptor
LigandBDBM50393781
Substrate/Competitorn/a
Meas. Tech.ChEMBL_857258 (CHEMBL2160603)
IC50 307±n/a nM
Citation Xiong, YGuo, JCandelore, MRLiang, RMiller, CDallas-Yang, QJiang, GMcCann, PEQureshi, SATong, XXu, SSShang, JVincent, SHTota, LMWright, MJYang, XZhang, BBTata, JRParmee, ER Discovery of a novel glucagon receptor antagonist N-[(4-{(1S)-1-[3-(3, 5-dichlorophenyl)-5-(6-methoxynaphthalen-2-yl)-1H-pyrazol-1-yl]ethyl}phenyl)carbonyl]-ß-alanine (MK-0893) for the treatment of type II diabetes. J Med Chem55:6137-48 (2012) 
 
Gastric inhibitory polypeptide receptor
Name:Gastric inhibitory polypeptide receptor
Type:PROTEIN
Mol. Mass.:53173.82
Organism:Homo sapiens (Human)
Description:ChEMBL_1518286
Residue:466
BDBM50393781
NameBDBM50393781
Synonyms:CHEMBL2159337
TypeSmall organic molecule
Emp. Form.C32H24Cl2F3N3O4
Mol. Mass.642.452
SMILESC[C@@H](c1ccc(cc1)C(=O)NCCC(O)=O)n1nc(cc1-c1ccc2cc(OC(F)(F)F)ccc2c1)-c1cc(Cl)cc(Cl)c1