Reaction Details
TargetCytochrome P450 2C8
LigandBDBM50360601
Substrate/Competitorn/a
Meas. Tech.ChEMBL_854489 (CHEMBL2160811)
IC50 2700±n/a nM
Citation Xiong, YGuo, JCandelore, MRLiang, RMiller, CDallas-Yang, QJiang, GMcCann, PEQureshi, SATong, XXu, SSShang, JVincent, SHTota, LMWright, MJYang, XZhang, BBTata, JRParmee, ER Discovery of a novel glucagon receptor antagonist N-[(4-{(1S)-1-[3-(3, 5-dichlorophenyl)-5-(6-methoxynaphthalen-2-yl)-1H-pyrazol-1-yl]ethyl}phenyl)carbonyl]-ß-alanine (MK-0893) for the treatment of type II diabetes. J Med Chem55:6137-48 (2012) 
 
Cytochrome P450 2C8
Name:Cytochrome P450 2C8
Type:Protein
Mol. Mass.:55839.23
Organism:Homo sapiens (Human)
Description:P10632
Residue:490
BDBM50360601
NameBDBM50360601
Synonyms:CHEMBL1933349 | MK-0893
TypeSmall organic molecule
Emp. Form.C32H27Cl2N3O4
Mol. Mass.588.48
SMILESCOc1ccc2cc(ccc2c1)-c1cc(nn1[C@@H](C)c1ccc(cc1)C(=O)NCCC(O)=O)-c1cc(Cl)cc(Cl)c1