Reaction Details
TargetCholinesterase
LigandBDBM50394574
Substrate/Competitorn/a
Meas. Tech.ChEMBL_856750 (CHEMBL2162576)
IC50 2510±n/a nM
Citation Rizzo, STarozzi, ABartolini, MDa Costa, GBisi, AGobbi, SBelluti, FLigresti, AAllarà, MMonti, JPAndrisano, VDi Marzo, VHrelia, PRampa, A 2-Arylbenzofuran-based molecules as multipotent Alzheimer's disease modifying agents. Eur J Med Chem58:519-32 (2012) 
 
Cholinesterase
Name:Cholinesterase
Type:Homotetramer
Mol. Mass.:68422.27
Organism:Homo sapiens (Human)
Description:P06276
Residue:602
BDBM50394574
NameBDBM50394574
Synonyms:CHEMBL2160233
TypeSmall organic molecule
Emp. Form.C38H41NO5
Mol. Mass.591.7358
SMILESCOc1ccc(cc1OC)C(=O)c1c(oc2ccccc12)-c1cccc(OCCCCCCCN(C)Cc2ccccc2)c1