Reaction Details
TargetCannabinoid receptor 2
LigandBDBM50394572
Substrate/Competitorn/a
Meas. Tech.ChEMBL_856764 (CHEMBL2162732)
EC50 7060±n/a nM
Citation Rizzo, STarozzi, ABartolini, MDa Costa, GBisi, AGobbi, SBelluti, FLigresti, AAllarà, MMonti, JPAndrisano, VDi Marzo, VHrelia, PRampa, A 2-Arylbenzofuran-based molecules as multipotent Alzheimer's disease modifying agents. Eur J Med Chem58:519-32 (2012) 
 
Cannabinoid receptor 2
Name:Cannabinoid receptor 2
Type:G Protein-Coupled Receptor (GPCR)
Mol. Mass.:39690.94
Organism:Homo sapiens (Human)
Description:P34972
Residue:360
BDBM50394572
NameBDBM50394572
Synonyms:CHEMBL2160219
TypeSmall organic molecule
Emp. Form.C42H41NO3
Mol. Mass.607.7798
SMILESCN(CCCCCCCOc1ccc(cc1)-c1oc2ccccc2c1C(=O)c1ccc(cc1)-c1ccccc1)Cc1ccccc1