Reaction Details
TargetCannabinoid receptor 1
LigandBDBM50394577
Substrate/Competitorn/a
Meas. Tech.ChEMBL_856761 (CHEMBL2162729)
EC50>10000±n/a nM
Citation Rizzo, STarozzi, ABartolini, MDa Costa, GBisi, AGobbi, SBelluti, FLigresti, AAllarà, MMonti, JPAndrisano, VDi Marzo, VHrelia, PRampa, A 2-Arylbenzofuran-based molecules as multipotent Alzheimer's disease modifying agents. Eur J Med Chem58:519-32 (2012) 
 
Cannabinoid receptor 1
Name:Cannabinoid receptor 1
Type:G Protein-Coupled Receptor (GPCR)
Mol. Mass.:52868.96
Organism:Homo sapiens (Human)
Description:P21554
Residue:472
BDBM50394577
NameBDBM50394577
Synonyms:CHEMBL2160221
TypeSmall organic molecule
Emp. Form.C41H48N2O3
Mol. Mass.616.8314
SMILESCCN(CC)Cc1cccc(c1)C(=O)c1c(oc2ccccc12)-c1ccc(OCCCCCCCN(C)Cc2ccccc2)cc1