Reaction Details
TargetCholinesterase
LigandBDBM50394570
Substrate/Competitorn/a
Meas. Tech.ChEMBL_856750 (CHEMBL2162576)
IC50 23000±n/a nM
Citation Rizzo, STarozzi, ABartolini, MDa Costa, GBisi, AGobbi, SBelluti, FLigresti, AAllarà, MMonti, JPAndrisano, VDi Marzo, VHrelia, PRampa, A 2-Arylbenzofuran-based molecules as multipotent Alzheimer's disease modifying agents. Eur J Med Chem58:519-32 (2012) 
 
Cholinesterase
Name:Cholinesterase
Type:Homotetramer
Mol. Mass.:68422.27
Organism:Homo sapiens (Human)
Description:P06276
Residue:602
BDBM50394570
NameBDBM50394570
Synonyms:CHEMBL2160224
TypeSmall organic molecule
Emp. Form.C42H50N2O4
Mol. Mass.646.8574
SMILESCCN(CC)CCOc1ccc(cc1)C(=O)c1c(oc2ccccc12)-c1ccc(OCCCCCCCN(C)Cc2ccccc2)cc1