Reaction Details
TargetAcetylcholinesterase
LigandBDBM50394568
Substrate/Competitorn/a
Meas. Tech.ChEMBL_856751 (CHEMBL2162577)
IC50 37100±n/a nM
Citation Rizzo, STarozzi, ABartolini, MDa Costa, GBisi, AGobbi, SBelluti, FLigresti, AAllarà, MMonti, JPAndrisano, VDi Marzo, VHrelia, PRampa, A 2-Arylbenzofuran-based molecules as multipotent Alzheimer's disease modifying agents. Eur J Med Chem58:519-32 (2012) 
 
Acetylcholinesterase
Name:Acetylcholinesterase
Type:Enzyme
Mol. Mass.:67792.70
Organism:Homo sapiens (Human)
Description:P22303
Residue:614
BDBM50394568
NameBDBM50394568
Synonyms:CHEMBL2160223
TypeSmall organic molecule
Emp. Form.C42H50N2O4
Mol. Mass.646.8574
SMILESCCN(CC)CCOc1cccc(c1)C(=O)c1c(oc2ccccc12)-c1ccc(OCCCCCCCN(C)Cc2ccccc2)cc1