Reaction Details
TargetCholinesterase
LigandBDBM50394584
Substrate/Competitorn/a
Meas. Tech.ChEMBL_856750 (CHEMBL2162576)
IC50 55600±n/a nM
Citation Rizzo, STarozzi, ABartolini, MDa Costa, GBisi, AGobbi, SBelluti, FLigresti, AAllarà, MMonti, JPAndrisano, VDi Marzo, VHrelia, PRampa, A 2-Arylbenzofuran-based molecules as multipotent Alzheimer's disease modifying agents. Eur J Med Chem58:519-32 (2012) 
 
Cholinesterase
Name:Cholinesterase
Type:Homotetramer
Mol. Mass.:68422.27
Organism:Homo sapiens (Human)
Description:P06276
Residue:602
BDBM50394584
NameBDBM50394584
Synonyms:CHEMBL2160215
TypeSmall organic molecule
Emp. Form.C31H37NO2
Mol. Mass.455.631
SMILESCN(CCCCCCCCCOc1ccc(cc1)-c1cc2ccccc2o1)Cc1ccccc1