Reaction Details
TargetBombesin receptor subtype-3
LigandBDBM50394613
Substrate/Competitorn/a
Meas. Tech.ChEMBL_857725 (CHEMBL2168752)
EC50 57±n/a nM
Citation Chobanian, HRGuo, YLiu, PChioda, MLanza, TJChang, LKelly, TMKan, YPalyha, OGuan, XMMarsh, DJMetzger, JMGorski, JNRaustad, KWang, SPStrack, AMMiller, RPang, JMadeira, MLyons, KDragovic, JReitman, MLNargund, RPLin, LS Discovery of MK-7725, A Potent, Selective Bombesin Receptor Subtype-3 Agonist for the Treatment of Obesity. ACS Med Chem Lett3:252-256 (2012) 
 
Bombesin receptor subtype-3
Name:Bombesin receptor subtype-3
Type:PROTEIN
Mol. Mass.:44239.49
Organism:Mus musculus
Description:ChEMBL_1445902
Residue:399
BDBM50394613
NameBDBM50394613
Synonyms:CHEMBL2164580
TypeSmall organic molecule
Emp. Form.C25H22F3N5O3S
Mol. Mass.529.534
SMILESCC(C)(C)c1ccc(cc1)S(=O)(=O)N1Cc2ccc(nc2Nc2cccc(-c3ncon3)c12)C(F)(F)F