Reaction Details
TargetBombesin receptor subtype-3
LigandBDBM50394609
Substrate/Competitorn/a
Meas. Tech.ChEMBL_857727 (CHEMBL2168754)
EC50 52±n/a nM
Citation Chobanian, HRGuo, YLiu, PChioda, MLanza, TJChang, LKelly, TMKan, YPalyha, OGuan, XMMarsh, DJMetzger, JMGorski, JNRaustad, KWang, SPStrack, AMMiller, RPang, JMadeira, MLyons, KDragovic, JReitman, MLNargund, RPLin, LS Discovery of MK-7725, A Potent, Selective Bombesin Receptor Subtype-3 Agonist for the Treatment of Obesity. ACS Med Chem Lett3:252-256 (2012) 
 
Bombesin receptor subtype-3
Name:Bombesin receptor subtype-3
Type:Enzyme Catalytic Domain
Mol. Mass.:44424.45
Organism:Homo sapiens (Human)
Description:Bombesin 3 BRS3 HUMAN::P32247
Residue:399
BDBM50394609
NameBDBM50394609
Synonyms:CHEMBL2164223
TypeSmall organic molecule
Emp. Form.C28H28F3N5O4S
Mol. Mass.587.613
SMILESCC(C)(C)c1ccc(cc1)S(=O)(=O)N1Cc2ccc(nc2Nc2cccc(-c3noc(n3)C(C)(C)O)c12)C(F)(F)F