Reaction Details
TargetBombesin receptor subtype-3
LigandBDBM50394613
Substrate/Competitorn/a
Meas. Tech.ChEMBL_857727 (CHEMBL2168754)
EC50 40±n/a nM
Citation Chobanian, HRGuo, YLiu, PChioda, MLanza, TJChang, LKelly, TMKan, YPalyha, OGuan, XMMarsh, DJMetzger, JMGorski, JNRaustad, KWang, SPStrack, AMMiller, RPang, JMadeira, MLyons, KDragovic, JReitman, MLNargund, RPLin, LS Discovery of MK-7725, A Potent, Selective Bombesin Receptor Subtype-3 Agonist for the Treatment of Obesity. ACS Med Chem Lett3:252-256 (2012) 
 
Bombesin receptor subtype-3
Name:Bombesin receptor subtype-3
Type:Enzyme Catalytic Domain
Mol. Mass.:44424.45
Organism:Homo sapiens (Human)
Description:Bombesin 3 BRS3 HUMAN::P32247
Residue:399
BDBM50394613
NameBDBM50394613
Synonyms:CHEMBL2164580
TypeSmall organic molecule
Emp. Form.C25H22F3N5O3S
Mol. Mass.529.534
SMILESCC(C)(C)c1ccc(cc1)S(=O)(=O)N1Cc2ccc(nc2Nc2cccc(-c3ncon3)c12)C(F)(F)F