Reaction Details
TargetEndothelin-1 receptor
LigandBDBM50395669
Substrate/Competitorn/a
Meas. Tech.ChEMBL_859881 (CHEMBL2166382)
IC50 4.3±n/a nM
Citation Bolli, MHBoss, CBinkert, CBuchmann, SBur, DHess, PIglarz, MMeyer, SRein, JRey, MTreiber, AClozel, MFischli, WWeller, T The discovery of N-[5-(4-bromophenyl)-6-[2-[(5-bromo-2-pyrimidinyl)oxy]ethoxy]-4-pyrimidinyl]-N'-propylsulfamide (Macitentan), an orally active, potent dual endothelin receptor antagonist. J Med Chem55:7849-61 (2012) 
 
Endothelin-1 receptor
Name:Endothelin-1 receptor
Type:Enzyme Catalytic Domain
Mol. Mass.:48736.88
Organism:Homo sapiens (Human)
Description:P25101
Residue:427
BDBM50395669
NameBDBM50395669
Synonyms:CHEMBL2163697
TypeSmall organic molecule
Emp. Form.C31H31N7O6S
Mol. Mass.629.686
SMILESCOc1ccccc1Oc1c(NS(=O)(=O)c2ccc(cc2)C(C)(C)C)nc(nc1OCCOc1ncccn1)-c1ncccn1