Reaction Details
TargetEndothelin receptor type B
LigandBDBM50395641
Substrate/Competitorn/a
Meas. Tech.ChEMBL_859880 (CHEMBL2166381)
IC50 192±n/a nM
Citation Bolli, MHBoss, CBinkert, CBuchmann, SBur, DHess, PIglarz, MMeyer, SRein, JRey, MTreiber, AClozel, MFischli, WWeller, T The discovery of N-[5-(4-bromophenyl)-6-[2-[(5-bromo-2-pyrimidinyl)oxy]ethoxy]-4-pyrimidinyl]-N'-propylsulfamide (Macitentan), an orally active, potent dual endothelin receptor antagonist. J Med Chem55:7849-61 (2012) 
 
Endothelin receptor type B
Name:Endothelin receptor type B
Type:Enzyme Catalytic Domain
Mol. Mass.:49664.00
Organism:Homo sapiens (Human)
Description:ENDOTHELIN B EDNRB HUMAN::P24530
Residue:442
BDBM50395641
NameBDBM50395641
Synonyms:CHEMBL2163725
TypeSmall organic molecule
Emp. Form.C28H30BrN7O7S
Mol. Mass.688.55
SMILESCOc1ccccc1Oc1c(NS(=O)(=O)NCc2ccccc2)nc(nc1OCCOc1ncc(Br)cn1)N1CCOCC1