Reaction Details
TargetPhosphatidylinositol 4,5-bisphosphate 3-kinase catalytic subunit alpha isoform
LigandBDBM50396302
Substrate/Competitorn/a
Meas. Tech.ChEMBL_864282 (CHEMBL2175553)
IC50 85±n/a nM
Citation Peterson, EABoezio, AAAndrews, PSBoezio, CMBush, TLCheng, ACChoquette, DCoats, JRColletti, AECopeland, KWDuPont, MGraceffa, RGrubinska, BKim, JLLewis, RTLiu, JMullady, ELPotashman, MHRomero, KShaffer, PLStanton, MKStellwagen, JCTeffera, YYi, SCai, TLa, DS Discovery and optimization of potent and selective imidazopyridine and imidazopyridazine mTOR inhibitors. Bioorg Med Chem Lett22:4967-74 (2012) 
 
Phosphatidylinositol 4,5-bisphosphate 3-kinase catalytic subunit alpha isoform
Name:Phosphatidylinositol 4,5-bisphosphate 3-kinase catalytic subunit alpha isoform
Type:Enzyme Subunit
Mol. Mass.:124294.87
Organism:Homo sapiens (Human)
Description:P42336
Residue:1068
BDBM50396302
NameBDBM50396302
Synonyms:CHEMBL2172485
TypeSmall organic molecule
Emp. Form.C18H15N11
Mol. Mass.385.3854
SMILESCc1nc(N)nc(n1)-c1c(Nc2ccn[nH]2)nc2ccc(cn12)-c1cncnc1