Reaction Details
TargetChloroquine resistance transporter
LigandBDBM519
Substrate/Competitorn/a
Meas. Tech.ChEMBL_864478 (CHEMBL2176281)
IC50 13000±n/a nM
Citation Gemma, SCamodeca, CSanna Coccone, SJoshi, BPBernetti, MMoretti, VBrogi, SBonache de Marcos, MCSavini, LTaramelli, DBasilico, NParapini, SRottmann, MBrun, RLamponi, SCaccia, SGuiso, GSummers, RLMartin, RESaponara, SGorelli, BNovellino, ECampiani, GButini, S Optimization of 4-aminoquinoline/clotrimazole-based hybrid antimalarials: further structure-activity relationships, in vivo studies, and preliminary toxicity profiling. J Med Chem55:6948-67 (2012) 
 
Chloroquine resistance transporter
Name:Chloroquine resistance transporter
Type:PROTEIN
Mol. Mass.:48687.29
Organism:Plasmodium falciparum
Description:ChEMBL_1364181
Residue:424
BDBM519
NameBDBM519
Synonyms:(2S)-N-[(2S,3R)-4-[(3S,4aS,8aS)-3-(tert-butylcarbamoyl)-decahydroisoquinolin-2-yl]-3-hydroxy-1-phenylbutan-2-yl]-2-(quinolin-2-ylformamido)butanediamide Fortovase Ro 31-8959 Saquinavir
TypeSmall organic molecule
Emp. Form.C38H50N6O5
Mol. Mass.670.8408
SMILESCC(C)(C)NC(=O)[C@@H]1C[C@@H]2CCCC[C@@H]2CN1C[C@@H](O)[C@H](Cc1ccccc1)NC(=O)[C@H](CC(N)=O)NC(=O)c1ccc2ccccc2n1