Reaction Details
TargetPhosphatidylinositol 4,5-bisphosphate 3-kinase catalytic subunit delta isoform
LigandBDBM50396640
Substrate/Competitorn/a
Meas. Tech.ChEMBL_864133 (CHEMBL2174981)
IC50 3±n/a nM
Citation Murray, JMSweeney, ZKChan, BKBalazs, MBradley, ECastanedo, GChabot, CChantry, DFlagella, MGoldstein, DMKondru, RLesnick, JLi, JLucas, MCNonomiya, JPang, JPrice, SSalphati, LSafina, BSavy, PPSeward, EMUltsch, MSutherlin, DP Potent and highly selective benzimidazole inhibitors of PI3-kinase delta. J Med Chem55:7686-95 (2012) 
 
Phosphatidylinositol 4,5-bisphosphate 3-kinase catalytic subunit delta isoform
Name:Phosphatidylinositol 4,5-bisphosphate 3-kinase catalytic subunit delta isoform
Type:Enzyme Subunit
Mol. Mass.:119489.41
Organism:Homo sapiens (Human)
Description:O00329
Residue:1044
BDBM50396640
NameBDBM50396640
Synonyms:CHEMBL2171941
TypeSmall organic molecule
Emp. Form.C28H35N9O2
Mol. Mass.529.6366
SMILESCCc1nc2ccccc2n1-c1nc(N2CCOCC2)c2nc(CN3C[C@@H]4C[C@H]3CN4C3COC3)n(C)c2n1