Reaction Details
TargetPhosphatidylinositol 4,5-bisphosphate 3-kinase catalytic subunit delta isoform
LigandBDBM25028
Substrate/Competitorn/a
Meas. Tech.ChEMBL_864133 (CHEMBL2174981)
IC50 3±n/a nM
Citation Murray, JMSweeney, ZKChan, BKBalazs, MBradley, ECastanedo, GChabot, CChantry, DFlagella, MGoldstein, DMKondru, RLesnick, JLi, JLucas, MCNonomiya, JPang, JPrice, SSalphati, LSafina, BSavy, PPSeward, EMUltsch, MSutherlin, DP Potent and highly selective benzimidazole inhibitors of PI3-kinase delta. J Med Chem55:7686-95 (2012) 
 
Phosphatidylinositol 4,5-bisphosphate 3-kinase catalytic subunit delta isoform
Name:Phosphatidylinositol 4,5-bisphosphate 3-kinase catalytic subunit delta isoform
Type:Enzyme Subunit
Mol. Mass.:119489.41
Organism:Homo sapiens (Human)
Description:O00329
Residue:1044
BDBM25028
NameBDBM25028
Synonyms:4-[2-(1H-indazol-4-yl)-6-[(4-methanesulfonylpiperazin-1-yl)methyl]thieno[3,2-d]pyrimidin-4-yl]morpholine GDC0941 US10851091, Compound pictilisib
TypeSmall organic molecule
Emp. Form.C23H27N7O3S2
Mol. Mass.513.636
SMILESCS(=O)(=O)N1CCN(Cc2cc3nc(nc(N4CCOCC4)c3s2)-c2cccc3[nH]ncc23)CC1