Reaction Details
TargetHepatocyte growth factor receptor
LigandBDBM50396976
Substrate/Competitorn/a
Meas. Tech.ChEMBL_863095 (CHEMBL2175491)
Ki 1.3±n/a nM
Citation Cui, JJMcTigue, MNambu, MTran-Dubé, MPairish, MShen, HJia, LCheng, HHoffman, JLe, PJalaie, MGoetz, GHRyan, KGrodsky, NDeng, YLParker, MTimofeevski, SMurray, BWYamazaki, SAguirre, SLi, QZou, HChristensen, J Discovery of a novel class of exquisitely selective mesenchymal-epithelial transition factor (c-MET) protein kinase inhibitors and identification of the clinical candidate 2-(4-(1-(quinolin-6-ylmethyl)-1H-[1,2,3]triazolo[4,5-b]pyrazin-6-yl)-1H-pyrazol-1-yl)ethanol (PF-04217903) for the treatment of J Med Chem55:8091-109 (2012) 
 
Hepatocyte growth factor receptor
Name:Hepatocyte growth factor receptor
Type:Protein
Mol. Mass.:155559.73
Organism:Homo sapiens (Human)
Description:P08581
Residue:1390
BDBM50396976
NameBDBM50396976
Synonyms:CHEMBL2170969
TypeSmall organic molecule
Emp. Form.C18H16ClN3O3
Mol. Mass.357.791
SMILESC[C@H](C(=O)NN=C1C(=O)Nc2c1c(Cl)ccc2C)c1ccc(O)cc1