Reaction Details
TargetHistone-lysine N-methyltransferase SUV39H1
LigandBDBM50396980
Substrate/Competitorn/a
Meas. Tech.ChEMBL_863116 (CHEMBL2175614)
Ki>100000±n/a nM
Citation Anglin, JLDeng, LYao, YCai, GLiu, ZJiang, HCheng, GChen, PDong, SSong, Y Synthesis and structure-activity relationship investigation of adenosine-containing inhibitors of histone methyltransferase DOT1L. J Med Chem55:8066-74 (2012) 
 
Histone-lysine N-methyltransferase SUV39H1
Name:Histone-lysine N-methyltransferase SUV39H1
Type:PROTEIN
Mol. Mass.:47917.07
Organism:Homo sapiens (Human)
Description:ChEMBL_1473655
Residue:412
BDBM50396980
NameBDBM50396980
Synonyms:CHEMBL2171169
TypeSmall organic molecule
Emp. Form.C27H40N8O4
Mol. Mass.540.6577
SMILESCC(C)N(CCCNC(=O)Nc1ccc(cc1)C(C)(C)C)C[C@H]1O[C@H]([C@H](O)[C@@H]1O)n1cnc2c(N)ncnc12