Reaction Details
TargetHistone-lysine N-methyltransferase SUV39H1
LigandBDBM50396981
Substrate/Competitorn/a
Meas. Tech.ChEMBL_863116 (CHEMBL2175614)
Ki>100000±n/a nM
Citation Anglin, JLDeng, LYao, YCai, GLiu, ZJiang, HCheng, GChen, PDong, SSong, Y Synthesis and structure-activity relationship investigation of adenosine-containing inhibitors of histone methyltransferase DOT1L. J Med Chem55:8066-74 (2012) 
 
Histone-lysine N-methyltransferase SUV39H1
Name:Histone-lysine N-methyltransferase SUV39H1
Type:PROTEIN
Mol. Mass.:47917.07
Organism:Homo sapiens (Human)
Description:ChEMBL_1473655
Residue:412
BDBM50396981
NameBDBM50396981
Synonyms:CHEMBL2171174
TypeSmall organic molecule
Emp. Form.C15H22N6O5S
Mol. Mass.398.437
SMILESCNc1ncnc2n(cnc12)[C@@H]1O[C@H](CSCC[C@H](N)C(O)=O)[C@@H](O)[C@H]1O