Reaction Details
TargetHistone-arginine methyltransferase CARM1
LigandBDBM50396979
Substrate/Competitorn/a
Meas. Tech.ChEMBL_863115 (CHEMBL2175613)
Ki>100000±n/a nM
Citation Anglin, JLDeng, LYao, YCai, GLiu, ZJiang, HCheng, GChen, PDong, SSong, Y Synthesis and structure-activity relationship investigation of adenosine-containing inhibitors of histone methyltransferase DOT1L. J Med Chem55:8066-74 (2012) 
 
Histone-arginine methyltransferase CARM1
Name:Histone-arginine methyltransferase CARM1
Type:Protein
Mol. Mass.:65855.47
Organism:Homo sapiens (Human)
Description:Q86X55
Residue:608
BDBM50396979
NameBDBM50396979
Synonyms:CHEMBL2171170
TypeSmall organic molecule
Emp. Form.C28H42N8O4
Mol. Mass.554.6843
SMILESCNc1ncnc2n(cnc12)[C@@H]1O[C@H](CN(CCCNC(=O)Nc2ccc(cc2)C(C)(C)C)C(C)C)[C@@H](O)[C@H]1O