Reaction Details
TargetProtein arginine N-methyltransferase 1 [11-371]
LigandBDBM50396978
Substrate/Competitorn/a
Meas. Tech.ChEMBL_863117 (CHEMBL2175615)
Ki>100000±n/a nM
Citation Anglin, JLDeng, LYao, YCai, GLiu, ZJiang, HCheng, GChen, PDong, SSong, Y Synthesis and structure-activity relationship investigation of adenosine-containing inhibitors of histone methyltransferase DOT1L. J Med Chem55:8066-74 (2012) 
 
Protein arginine N-methyltransferase 1 [11-371]
Name:Protein arginine N-methyltransferase 1 [11-371]
Type:Protein
Mol. Mass.:41506.52
Organism:Homo sapiens (Human)
Description:Q99873[11-371]
Residue:361
BDBM50396978
NameBDBM50396978
Synonyms:CHEMBL2171171
TypeSmall organic molecule
Emp. Form.C30H44N8O4
Mol. Mass.580.7216
SMILESCC(C)N(CCCNC(=O)Nc1ccc(cc1)C(C)(C)C)C[C@H]1O[C@H]([C@H](O)[C@@H]1O)n1cnc2c(NCC=C)ncnc12