Reaction Details
TargetProtein arginine N-methyltransferase 1 [11-371]
LigandBDBM50396981
Substrate/Competitorn/a
Meas. Tech.ChEMBL_863117 (CHEMBL2175615)
Ki 22700±n/a nM
Citation Anglin, JLDeng, LYao, YCai, GLiu, ZJiang, HCheng, GChen, PDong, SSong, Y Synthesis and structure-activity relationship investigation of adenosine-containing inhibitors of histone methyltransferase DOT1L. J Med Chem55:8066-74 (2012) 
 
Protein arginine N-methyltransferase 1 [11-371]
Name:Protein arginine N-methyltransferase 1 [11-371]
Type:Protein
Mol. Mass.:41506.52
Organism:Homo sapiens (Human)
Description:Q99873[11-371]
Residue:361
BDBM50396981
NameBDBM50396981
Synonyms:CHEMBL2171174
TypeSmall organic molecule
Emp. Form.C15H22N6O5S
Mol. Mass.398.437
SMILESCNc1ncnc2n(cnc12)[C@@H]1O[C@H](CSCC[C@H](N)C(O)=O)[C@@H](O)[C@H]1O