Reaction Details
TargetTyrosyl-DNA phosphodiesterase 1
LigandBDBM50397315
Substrate/Competitorn/a
Meas. Tech.ChEMBL_864727 (CHEMBL2174994)
IC50 7100±n/a nM
Citation Sirivolu, VRVernekar, SKMarchand, CNaumova, AChergui, ARenaud, AStephen, AGChen, FSham, YYPommier, YWang, Z 5-Arylidenethioxothiazolidinones as inhibitors of tyrosyl-DNA phosphodiesterase I. J Med Chem55:8671-84 (2012) 
 
Tyrosyl-DNA phosphodiesterase 1
Name:Tyrosyl-DNA phosphodiesterase 1
Type:Enzyme
Mol. Mass.:68430.66
Organism:Homo sapiens (Human)
Description:Q9NUW8
Residue:608
BDBM50397315
NameBDBM50397315
Synonyms:CHEMBL2170126
TypeSmall organic molecule
Emp. Form.C10H7NO3S2
Mol. Mass.253.297
SMILESOC1=NC(=S)C(S1)=Cc1cc(O)ccc1O