Reaction Details
TargetTyrosyl-DNA phosphodiesterase 1
LigandBDBM51138
Substrate/Competitorn/a
Meas. Tech.ChEMBL_864727 (CHEMBL2174994)
IC50 40000±n/a nM
Citation Sirivolu, VRVernekar, SKMarchand, CNaumova, AChergui, ARenaud, AStephen, AGChen, FSham, YYPommier, YWang, Z 5-Arylidenethioxothiazolidinones as inhibitors of tyrosyl-DNA phosphodiesterase I. J Med Chem55:8671-84 (2012) 
 
Tyrosyl-DNA phosphodiesterase 1
Name:Tyrosyl-DNA phosphodiesterase 1
Type:Enzyme
Mol. Mass.:68430.66
Organism:Homo sapiens (Human)
Description:Q9NUW8
Residue:608
BDBM51138
NameBDBM51138
Synonyms:(5Z)-5-[(1-methyl-3-indolyl)methylidene]-4-sulfanylidene-2-thiazolidinone (5Z)-5-[(1-methylindol-3-yl)methylidene]-4-sulfanylidene-1,3-thiazolidin-2-one MLS000698017 cid_1236521
TypeSmall organic molecule
Emp. Form.C13H10N2OS2
Mol. Mass.274.361
SMILESCn1cc(C=C2SC(O)=NC2=S)c2ccccc12