Reaction Details
TargetBeta-secretase 1
LigandBDBM50397708
Substrate/Competitorn/a
Meas. Tech.ChEMBL_874114 (CHEMBL2187055)
IC50 1.9±n/a nM
Citation Dineen, TAWeiss, MMWilliamson, TActon, PBabu-Khan, SBartberger, MDBrown, JChen, KCheng, YCitron, MCroghan, MDDunn, RTEsmay, JGraceffa, RFHarried, SSHickman, DHitchcock, SAHorne, DBHuang, HImbeah-Ampiah, RJudd, TKaller, MRKreiman, CRLa, DSLi, VLopez, PLouie, SMonenschein, HNguyen, TTPennington, LDSan Miguel, TSickmier, EAVargas, HMWahl, RCWen, PHWhittington, DAWood, SXue, QYang, BHPatel, VFZhong, W Design and synthesis of potent, orally efficacious hydroxyethylamine derivedß-site amyloid precursor protein cleaving enzyme (BACE1) inhibitors. J Med Chem55:9025-44 (2012) 
 
Beta-secretase 1
Name:Beta-secretase 1
Type:Protein
Mol. Mass.:55755.10
Organism:Homo sapiens (Human)
Description:P56817
Residue:501
BDBM50397708
NameBDBM50397708
Synonyms:CHEMBL2181906
TypeSmall organic molecule
Emp. Form.C31H40FN3O4
Mol. Mass.537.6654
SMILESCOCC(=O)N[C@@H](Cc1cc(F)cc(c1)C#C)[C@H](O)CN[C@H]1CC2(CCC2)Oc2ncc(CC(C)(C)C)cc12