Reaction Details
TargetRAC-alpha serine/threonine-protein kinase
LigandBDBM15138
Substrate/Competitorn/a
Meas. Tech.ChEMBL_874386 (CHEMBL2183039)
IC50>100000±n/a nM
Citation Ashwell, MALapierre, JMBrassard, CBresciano, KBull, CCornell-Kennon, SEathiraj, SFrance, DSHall, THill, JKelleher, EKhanapurkar, SKizer, DKoerner, SLink, JLiu, YMakhija, SMoussa, MNamdev, NNguyen, KNicewonger, RPalma, RSzwaya, JTandon, MUppalapati, UVensel, DVolak, LPVolckova, EWestlund, NWu, HYang, RYChan, TC Discovery and optimization of a series of 3-(3-phenyl-3H-imidazo[4,5-b]pyridin-2-yl)pyridin-2-amines: orally bioavailable, selective, and potent ATP-independent Akt inhibitors. J Med Chem55:5291-310 (2012) 
 
RAC-alpha serine/threonine-protein kinase
Name:RAC-alpha serine/threonine-protein kinase
Type:Enzyme
Mol. Mass.:55681.25
Organism:Homo sapiens (Human)
Description:P31749
Residue:480
BDBM15138
NameBDBM15138
Synonyms:5-indazolyl pyridine 11g A-674563 indazole-pyridine, 7
TypeSmall organic molecule
Emp. Form.C22H22N4O
Mol. Mass.358.4363
SMILESCc1n[nH]c2ccc(cc12)-c1cncc(OC[C@@H](N)Cc2ccccc2)c1