Reaction Details
TargetCytochrome P450 2C8
LigandBDBM50397798
Substrate/Competitorn/a
Meas. Tech.ChEMBL_874592 (CHEMBL2186228)
IC50 1000±n/a nM
Citation Ashwell, MALapierre, JMBrassard, CBresciano, KBull, CCornell-Kennon, SEathiraj, SFrance, DSHall, THill, JKelleher, EKhanapurkar, SKizer, DKoerner, SLink, JLiu, YMakhija, SMoussa, MNamdev, NNguyen, KNicewonger, RPalma, RSzwaya, JTandon, MUppalapati, UVensel, DVolak, LPVolckova, EWestlund, NWu, HYang, RYChan, TC Discovery and optimization of a series of 3-(3-phenyl-3H-imidazo[4,5-b]pyridin-2-yl)pyridin-2-amines: orally bioavailable, selective, and potent ATP-independent Akt inhibitors. J Med Chem55:5291-310 (2012) 
 
Cytochrome P450 2C8
Name:Cytochrome P450 2C8
Type:Protein
Mol. Mass.:55839.23
Organism:Homo sapiens (Human)
Description:P10632
Residue:490
BDBM50397798
NameBDBM50397798
Synonyms:CHEMBL2177836
TypeSmall organic molecule
Emp. Form.C33H26FN7O2
Mol. Mass.571.6036
SMILESCC(=O)Nc1cccc(c1)-c1ccc2nc(-c3cccnc3N)n(-c3ccc(CNC(=O)c4cccc(F)c4)cc3)c2n1