Reaction Details
TargetLysosomal alpha-glucosidase
LigandBDBM50398020
Substrate/Competitorn/a
Meas. Tech.ChEMBL_873176 (CHEMBL2183407)
IC50 1630±n/a nM
Citation Xiao, JWestbroek, WMotabar, OLea, WAHu, XVelayati, AZheng, WSouthall, NGustafson, AMGoldin, ESidransky, ELiu, KSimeonov, ATamargo, RJRibes, AMatalonga, LFerrer, MMarugan, JJ Discovery of a novel noniminosugar acida glucosidase chaperone series. J Med Chem55:7546-59 (2012) 
 
Lysosomal alpha-glucosidase
Name:Lysosomal alpha-glucosidase
Type:PROTEIN
Mol. Mass.:105312.45
Organism:Homo sapiens (Human)
Description:ChEMBL_1506060
Residue:952
BDBM50398020
NameBDBM50398020
Synonyms:CHEMBL2181103
TypeSmall organic molecule
Emp. Form.C20H20ClN3O4S
Mol. Mass.433.908
SMILESCC(=O)c1ccc(cc1)N1CCN(CC1)S(=O)(=O)c1cc2CC(=O)Nc2cc1Cl